Reaction Details
TargetPhosphatidylinositol 3-kinase C2 domain-containing subunit gamma
LigandBDBM50160075
Substrate/Competitorn/a
Meas. Tech.ChEMBL_1565836 (CHEMBL3789699)
IC50 1000±n/a nM
Citation Rutaganira, FUFowler, MLMcPhail, JAGelman, MANguyen, KXiong, ADornan, GLTavshanjian, BGlenn, JSShokat, KMBurke, JE Design and Structural Characterization of Potent and Selective Inhibitors of Phosphatidylinositol 4 Kinase IIIß. J Med Chem59:1830-9 (2016) 
 
Phosphatidylinositol 3-kinase C2 domain-containing subunit gamma
Name:Phosphatidylinositol 3-kinase C2 domain-containing subunit gamma
Type:PROTEIN
Mol. Mass.:165726.35
Organism:Homo sapiens (Human)
Description:ChEMBL_1447686
Residue:1445
BDBM50160075
NameBDBM50160075
Synonyms:CHEMBL3786230
TypeSmall organic molecule
Emp. Form.C22H25N3O5S2
Mol. Mass.475.581
SMILESCOc1ccc(cc1S(=O)(=O)Nc1ccc(O)cc1)-c1sc(NC(=O)C(C)(C)C)nc1C