Reaction Details
TargetMonoglyceride lipase
LigandBDBM50160290
Substrate/Competitorn/a
Meas. Tech.ChEMBL_1566097 (CHEMBL3791725)
IC50>10000±n/a nM
Citation Brindisi, MMaramai, SGemma, SBrogi, SGrillo, ADi Cesare Mannelli, LGabellieri, ELamponi, SSaponara, SGorelli, BTedesco, DBonfiglio, TLandry, CJung, KMArmirotti, ALuongo, LLigresti, APiscitelli, FBertucci, CDehouck, MPCampiani, GMaione, SGhelardini, CPittaluga, APiomelli, DDi Marzo, VButini, S Development and Pharmacological Characterization of Selective Blockers of 2-Arachidonoyl Glycerol Degradation with Efficacy in Rodent Models of Multiple Sclerosis and Pain. J Med Chem59:2612-32 (2016) 
 
Monoglyceride lipase
Name:Monoglyceride lipase
Type:Hydrolase
Mol. Mass.:33264.56
Organism:Homo sapiens (Human)
Description:Human recombinant MGL (Cayman Chemical, cat# 10008354).
Residue:303
BDBM50160290
NameBDBM50160290
Synonyms:CHEMBL3786806
TypeSmall organic molecule
Emp. Form.C25H23FN4O4
Mol. Mass.462.4729
SMILESFc1ccc(cc1)[C@@H]1[C@H](N(C2CCN(CC2)C(=O)n2ccnc2)C1=O)c1ccc2OCOc2c1