Reaction Details
TargetPotassium voltage-gated channel subfamily A member 5
LigandBDBM50160692
Substrate/Competitorn/a
Meas. Tech.ChEMBL_1566418 (CHEMBL3790038)
IC50 1200±n/a nM
Citation Kajanus, JJacobson, IÅstrand, AOlsson, RIGran, UBjöre, AFjellström, ODavidsson, ÖEmtenäs, HDahlén, ALöfberg, BYuan, ZQSundell, JCassel, JGyll, JIliefski, THögberg, ÅLindhardt, EMalmberg, J Isoindolinone compounds active as Kv1.5 blockers identified using a multicomponent reaction approach. Bioorg Med Chem Lett26:2023-9 (2016) 
 
Potassium voltage-gated channel subfamily A member 5
Name:Potassium voltage-gated channel subfamily A member 5
Type:Enzyme
Mol. Mass.:67222.47
Organism:Homo sapiens (Human)
Description:P22460
Residue:613
BDBM50160692
NameBDBM50160692
Synonyms:CHEMBL3785810
TypeSmall organic molecule
Emp. Form.C28H28F2N2O3
Mol. Mass.478.5303
SMILESCc1c2C(=O)N(Cc3ccccc3-c3ccccc3)C(C(=O)NC(C)(C)C)c2ccc1OC(F)F