Reaction Details
TargetPotassium voltage-gated channel subfamily A member 5
LigandBDBM50160733
Substrate/Competitorn/a
Meas. Tech.ChEMBL_1566417 (CHEMBL3790037)
IC50 1200±n/a nM
Citation Kajanus, JJacobson, IÅstrand, AOlsson, RIGran, UBjöre, AFjellström, ODavidsson, ÖEmtenäs, HDahlén, ALöfberg, BYuan, ZQSundell, JCassel, JGyll, JIliefski, THögberg, ÅLindhardt, EMalmberg, J Isoindolinone compounds active as Kv1.5 blockers identified using a multicomponent reaction approach. Bioorg Med Chem Lett26:2023-9 (2016) 
 
Potassium voltage-gated channel subfamily A member 5
Name:Potassium voltage-gated channel subfamily A member 5
Type:Enzyme
Mol. Mass.:67222.47
Organism:Homo sapiens (Human)
Description:P22460
Residue:613
BDBM50160733
NameBDBM50160733
Synonyms:CHEMBL3787444
TypeSmall organic molecule
Emp. Form.C20H19ClF2N2O2
Mol. Mass.392.827
SMILESCC(CN1C(C(=O)NCC(F)F)c2ccccc2C1=O)c1ccc(Cl)cc1