Reaction Details
TargetPotassium voltage-gated channel subfamily A member 5
LigandBDBM50160718
Substrate/Competitorn/a
Meas. Tech.ChEMBL_1566417 (CHEMBL3790037)
IC50 400±n/a nM
Citation Kajanus, JJacobson, IÅstrand, AOlsson, RIGran, UBjöre, AFjellström, ODavidsson, ÖEmtenäs, HDahlén, ALöfberg, BYuan, ZQSundell, JCassel, JGyll, JIliefski, THögberg, ÅLindhardt, EMalmberg, J Isoindolinone compounds active as Kv1.5 blockers identified using a multicomponent reaction approach. Bioorg Med Chem Lett26:2023-9 (2016) 
 
Potassium voltage-gated channel subfamily A member 5
Name:Potassium voltage-gated channel subfamily A member 5
Type:Enzyme
Mol. Mass.:67222.47
Organism:Homo sapiens (Human)
Description:P22460
Residue:613
BDBM50160718
NameBDBM50160718
Synonyms:CHEMBL3786344
TypeSmall organic molecule
Emp. Form.C21H23ClN2O2
Mol. Mass.370.873
SMILESCCCNC(=O)C1N(CC(C)c2ccc(Cl)cc2)C(=O)c2ccccc12