Reaction Details
TargetPotassium voltage-gated channel subfamily A member 5
LigandBDBM50160697
Substrate/Competitorn/a
Meas. Tech.ChEMBL_1566417 (CHEMBL3790037)
IC50 800±n/a nM
Citation Kajanus, JJacobson, IÅstrand, AOlsson, RIGran, UBjöre, AFjellström, ODavidsson, ÖEmtenäs, HDahlén, ALöfberg, BYuan, ZQSundell, JCassel, JGyll, JIliefski, THögberg, ÅLindhardt, EMalmberg, J Isoindolinone compounds active as Kv1.5 blockers identified using a multicomponent reaction approach. Bioorg Med Chem Lett26:2023-9 (2016) 
 
Potassium voltage-gated channel subfamily A member 5
Name:Potassium voltage-gated channel subfamily A member 5
Type:Enzyme
Mol. Mass.:67222.47
Organism:Homo sapiens (Human)
Description:P22460
Residue:613
BDBM50160697
NameBDBM50160697
Synonyms:CHEMBL3785335
TypeSmall organic molecule
Emp. Form.C26H25FN2O2
Mol. Mass.416.4873
SMILESCC(C)(C)NC(=O)C1N(Cc2ccc(F)cc2-c2ccccc2)C(=O)c2ccccc12