Reaction Details
TargetPotassium voltage-gated channel subfamily A member 5
LigandBDBM50160565
Substrate/Competitorn/a
Meas. Tech.ChEMBL_1566417 (CHEMBL3790037)
IC50 900±n/a nM
Citation Kajanus, JJacobson, IÅstrand, AOlsson, RIGran, UBjöre, AFjellström, ODavidsson, ÖEmtenäs, HDahlén, ALöfberg, BYuan, ZQSundell, JCassel, JGyll, JIliefski, THögberg, ÅLindhardt, EMalmberg, J Isoindolinone compounds active as Kv1.5 blockers identified using a multicomponent reaction approach. Bioorg Med Chem Lett26:2023-9 (2016) 
 
Potassium voltage-gated channel subfamily A member 5
Name:Potassium voltage-gated channel subfamily A member 5
Type:Enzyme
Mol. Mass.:67222.47
Organism:Homo sapiens (Human)
Description:P22460
Residue:613
BDBM50160565
NameBDBM50160565
Synonyms:CHEMBL3786542
TypeSmall organic molecule
Emp. Form.C26H26N2O2
Mol. Mass.398.4968
SMILESCC(C)(C)NC(=O)C1N(Cc2ccccc2-c2ccccc2)C(=O)c2ccccc12