Reaction Details
TargetProstaglandin G/H synthase 1/2
LigandBDBM50140172
Substrate/Competitorn/a
Meas. Tech.ChEMBL_1570295 (CHEMBL3795271)
IC50 2000±n/a nM
Citation Mohd Aluwi, MFRullah, KYamin, BMLeong, SWAbdul Bahari, MNLim, SJMohd Faudzi, SMJalil, JAbas, FMohd Fauzi, NIsmail, NHJantan, ILam, KW Synthesis of unsymmetrical monocarbonyl curcumin analogues with potent inhibition on prostaglandin E2 production in LPS-induced murine and human macrophages cell lines. Bioorg Med Chem Lett26:2531-8 (2016) 
 
Prostaglandin G/H synthase 1/2
Name:Prostaglandin G/H synthase 1/2
Synonyms:Cyclooxygenase
Type:n/a
Mol. Mass.:n/a
Description:ASSAY_ID of ChEMBL is 1570295
Components:This complex has 2 components.
Component 1
Name:Prostaglandin G/H synthase 2
Type:PROTEIN
Mol. Mass.:69173.20
Organism:Bos taurus
Description:ChEMBL_157990
Residue:604
Component 2
Name:Prostaglandin G/H synthase 1
Synonyms:COX-1 Cyclooxygenase PGH1_BOVIN | PTGS1
Type:PROTEIN
Mol. Mass.:68814.10
Organism:Bos taurus
Description:ChEMBL_547440
Residue:600
BDBM50140172
NameBDBM50140172
Synonyms:CHEBI:3962 Curcumin | US9409845, Table 1, Compound 21: curcumin
TypeSmall organic molecule
Emp. Form.C21H20O6
Mol. Mass.368.3799
SMILESCOc1cc(\C=C\C(=O)CC(=O)\C=C\c2ccc(O)c(OC)c2)ccc1O