Reaction Details
TargetAurora kinase B
LigandBDBM50160896
Substrate/Competitorn/a
Meas. Tech.ChEMBL_1570319 (CHEMBL3795295)
IC50 54800±n/a nM
Citation Jeong, YLee, JRyu, JS Design, synthesis, and evaluation of hinge-binder tethered 1,2,3-triazolylsalicylamide derivatives as Aurora kinase inhibitors. Bioorg Med Chem24:2114-24 (2016) 
 
Aurora kinase B
Name:Aurora kinase B
Type:Protein
Mol. Mass.:39327.72
Organism:Homo sapiens (Human)
Description:Q96GD4
Residue:344
BDBM50160896
NameBDBM50160896
Synonyms:CHEMBL3794450
TypeSmall organic molecule
Emp. Form.C22H20N6O5
Mol. Mass.448.4314
SMILESCOC(=O)c1cccc(NC(=O)c2cc(ccc2O)-n2cc(CNc3cc(C)on3)nn2)c1