Reaction Details
TargetAurora kinase B
LigandBDBM50160994
Substrate/Competitorn/a
Meas. Tech.ChEMBL_1570319 (CHEMBL3795295)
IC50 1330±n/a nM
Citation Jeong, YLee, JRyu, JS Design, synthesis, and evaluation of hinge-binder tethered 1,2,3-triazolylsalicylamide derivatives as Aurora kinase inhibitors. Bioorg Med Chem24:2114-24 (2016) 
 
Aurora kinase B
Name:Aurora kinase B
Type:Protein
Mol. Mass.:39327.72
Organism:Homo sapiens (Human)
Description:Q96GD4
Residue:344
BDBM50160994
NameBDBM50160994
Synonyms:CHEMBL3794572
TypeSmall organic molecule
Emp. Form.C23H17N5O6
Mol. Mass.459.411
SMILESCOC(=O)c1cccc(NC(=O)c2cc(ccc2O)-n2cc(nn2)-c2cccc(c2)[N+]([O-])=O)c1