Reaction Details
TargetAurora kinase A
LigandBDBM50160993
Substrate/Competitorn/a
Meas. Tech.ChEMBL_1570318 (CHEMBL3795294)
IC50 607±n/a nM
Citation Jeong, YLee, JRyu, JS Design, synthesis, and evaluation of hinge-binder tethered 1,2,3-triazolylsalicylamide derivatives as Aurora kinase inhibitors. Bioorg Med Chem24:2114-24 (2016) 
 
Aurora kinase A
Name:Aurora kinase A
Type:Serine/threonine-protein kinase
Mol. Mass.:45830.98
Organism:Homo sapiens (Human)
Description:O14965
Residue:403
BDBM50160993
NameBDBM50160993
Synonyms:CHEMBL3793945
TypeSmall organic molecule
Emp. Form.C25H18N6O4
Mol. Mass.466.4482
SMILESCOC(=O)c1cccc(NC(=O)c2cc(ccc2O)-n2cc(nn2)-c2ccc3nccnc3c2)c1