Reaction Details
TargetCyclin-dependent kinase 5 activator 1
LigandBDBM50399301
Substrate/Competitorn/a
Meas. Tech.ChEMBL_1567129 (CHEMBL3787886)
IC50 70±n/a nM
Citation Ouach, ABoulahjar, RVala, CBourg, SBonnet, PGuguen-Guillouzo, CRavache, MLe Guevel, RLozach, OLazar, STroin, YMeijer, LRuchaud, SAkssira, MGuillaumet, GRoutier, S Novel optimization of valmerins (tetrahydropyrido[1,2-a]isoindolones) as potent dual CDK5/GSK3 inhibitors. Eur J Med Chem115:311-25 (2016) 
 
Cyclin-dependent kinase 5 activator 1
Name:Cyclin-dependent kinase 5 activator 1
Type:Protein Complex
Mol. Mass.:n/a
Description:n/a
Components:This complex has 2 components.
Component 1
Name:Cyclin-dependent kinase 5
Synonyms:CDK5 CDKN5 Cyclin-dependent kinase 5 (CDK5/ p25) Cyclin-dependent-like kinase 5 PSSALRE Tau protein kinase II catalytic subunit
Type:Enzyme Subunit
Mol. Mass.:33308.61
Organism:Homo sapiens (Human)
Description:n/a
Residue:292
Component 2
Name:Cyclin-dependent kinase 5 activator 1
Synonyms:CD5R1_HUMAN CDK5R1 Cyclin-dependent kinase 5 (CDK5/p25) NCK5A p35
Type:Enzyme Subunit
Mol. Mass.:34077.43
Organism:Homo sapiens (Human)
Description:Q15078
Residue:307
BDBM50399301
NameBDBM50399301
Synonyms:CHEMBL2180862
TypeSmall organic molecule
Emp. Form.C18H18N4O2
Mol. Mass.322.3611
SMILESO=C(Nc1ccccn1)Nc1cccc2C(=O)N3CCCCC3c12