Reaction Details
TargetDual specificity tyrosine-phosphorylation-regulated kinase 1A
LigandBDBM50161352
Substrate/Competitorn/a
Meas. Tech.ChEMBL_1567130 (CHEMBL3787887)
IC50>10000±n/a nM
Citation Ouach, ABoulahjar, RVala, CBourg, SBonnet, PGuguen-Guillouzo, CRavache, MLe Guevel, RLozach, OLazar, STroin, YMeijer, LRuchaud, SAkssira, MGuillaumet, GRoutier, S Novel optimization of valmerins (tetrahydropyrido[1,2-a]isoindolones) as potent dual CDK5/GSK3 inhibitors. Eur J Med Chem115:311-25 (2016) 
 
Dual specificity tyrosine-phosphorylation-regulated kinase 1A
Name:Dual specificity tyrosine-phosphorylation-regulated kinase 1A
Type:Enzyme
Mol. Mass.:85616.61
Organism:Homo sapiens (Human)
Description:Q13627
Residue:763
BDBM50161352
NameBDBM50161352
Synonyms:CHEMBL3785804
TypeSmall organic molecule
Emp. Form.C20H22N4O3
Mol. Mass.366.4137
SMILESCOCc1cccc(NC(=O)Nc2cccc3C(=O)N4CCCCC4c23)n1