Reaction Details
TargetAcetylcholinesterase
LigandBDBM50161478
Substrate/Competitorn/a
Meas. Tech.ChEMBL_1567404 (CHEMBL3790087)
Ki 1.1±n/a nM
Citation Özgeris, BGöksu, SPolat Köse, LGülçin, ISalmas, REDurdagi, STümer, FSupuran, CT Acetylcholinesterase and carbonic anhydrase inhibitory properties of novel urea and sulfamide derivatives incorporating dopaminergic 2-aminotetralin scaffolds. Bioorg Med Chem24:2318-29 (2016) 
 
Acetylcholinesterase
Name:Acetylcholinesterase
Type:Enzyme
Mol. Mass.:67792.70
Organism:Homo sapiens (Human)
Description:P22303
Residue:614
BDBM50161478
NameBDBM50161478
Synonyms:CHEMBL3787223
TypeSmall organic molecule
Emp. Form.C13H20N2O3S
Mol. Mass.284.374
SMILESCOc1ccc2CC(CCc2c1)NS(=O)(=O)N(C)C