Reaction Details
TargetAcetylcholinesterase
LigandBDBM50161480
Substrate/Competitorn/a
Meas. Tech.ChEMBL_1567404 (CHEMBL3790087)
Ki 1.6±n/a nM
Citation Özgeris, BGöksu, SPolat Köse, LGülçin, ISalmas, REDurdagi, STümer, FSupuran, CT Acetylcholinesterase and carbonic anhydrase inhibitory properties of novel urea and sulfamide derivatives incorporating dopaminergic 2-aminotetralin scaffolds. Bioorg Med Chem24:2318-29 (2016) 
 
Acetylcholinesterase
Name:Acetylcholinesterase
Type:Enzyme
Mol. Mass.:67792.70
Organism:Homo sapiens (Human)
Description:P22303
Residue:614
BDBM50161480
NameBDBM50161480
Synonyms:CHEMBL3786937
TypeSmall organic molecule
Emp. Form.C13H18N2O2
Mol. Mass.234.2942
SMILESCN(C)C(=O)N[C@H]1CCc2c(O)cccc2C1