Reaction Details
TargetAcetylcholinesterase
LigandBDBM50161482
Substrate/Competitorn/a
Meas. Tech.ChEMBL_1567404 (CHEMBL3790087)
Ki 1.7±n/a nM
Citation Özgeris, BGöksu, SPolat Köse, LGülçin, ISalmas, REDurdagi, STümer, FSupuran, CT Acetylcholinesterase and carbonic anhydrase inhibitory properties of novel urea and sulfamide derivatives incorporating dopaminergic 2-aminotetralin scaffolds. Bioorg Med Chem24:2318-29 (2016) 
 
Acetylcholinesterase
Name:Acetylcholinesterase
Type:Enzyme
Mol. Mass.:67792.70
Organism:Homo sapiens (Human)
Description:P22303
Residue:614
BDBM50161482
NameBDBM50161482
Synonyms:CHEMBL3785207
TypeSmall organic molecule
Emp. Form.C13H18N2O2
Mol. Mass.234.2942
SMILESCN(C)C(=O)N[C@H]1CCc2ccc(O)cc2C1