Reaction Details
TargetAcetylcholinesterase
LigandBDBM50161483
Substrate/Competitorn/a
Meas. Tech.ChEMBL_1567404 (CHEMBL3790087)
Ki 1.3±n/a nM
Citation Özgeris, BGöksu, SPolat Köse, LGülçin, ISalmas, REDurdagi, STümer, FSupuran, CT Acetylcholinesterase and carbonic anhydrase inhibitory properties of novel urea and sulfamide derivatives incorporating dopaminergic 2-aminotetralin scaffolds. Bioorg Med Chem24:2318-29 (2016) 
 
Acetylcholinesterase
Name:Acetylcholinesterase
Type:Enzyme
Mol. Mass.:67792.70
Organism:Homo sapiens (Human)
Description:P22303
Residue:614
BDBM50161483
NameBDBM50161483
Synonyms:CHEMBL3786873
TypeSmall organic molecule
Emp. Form.C12H18N2O3S
Mol. Mass.270.348
SMILESCN(C)S(=O)(=O)NC1CCc2c(O)cccc2C1