Reaction Details
TargetCarbonic anhydrase 1
LigandBDBM50161484
Substrate/Competitorn/a
Meas. Tech.ChEMBL_1567402 (CHEMBL3789780)
Ki 3.2±n/a nM
Citation Özgeris, BGöksu, SPolat Köse, LGülçin, ISalmas, REDurdagi, STümer, FSupuran, CT Acetylcholinesterase and carbonic anhydrase inhibitory properties of novel urea and sulfamide derivatives incorporating dopaminergic 2-aminotetralin scaffolds. Bioorg Med Chem24:2318-29 (2016) 
 
Carbonic anhydrase 1
Name:Carbonic anhydrase 1
Type:Enzyme
Mol. Mass.:28873.37
Organism:Homo sapiens (Human)
Description:P00915
Residue:261
BDBM50161484
NameBDBM50161484
Synonyms:CHEMBL3786442
TypeSmall organic molecule
Emp. Form.C12H18N2O3S
Mol. Mass.270.348
SMILESCN(C)S(=O)(=O)N[C@H]1CCc2cc(O)ccc2C1