Reaction Details
TargetAcetylcholinesterase
LigandBDBM50161487
Substrate/Competitorn/a
Meas. Tech.ChEMBL_1567404 (CHEMBL3790087)
Ki 0.670000±n/a nM
Citation Özgeris, BGöksu, SPolat Köse, LGülçin, ISalmas, REDurdagi, STümer, FSupuran, CT Acetylcholinesterase and carbonic anhydrase inhibitory properties of novel urea and sulfamide derivatives incorporating dopaminergic 2-aminotetralin scaffolds. Bioorg Med Chem24:2318-29 (2016) 
 
Acetylcholinesterase
Name:Acetylcholinesterase
Type:Enzyme
Mol. Mass.:67792.70
Organism:Homo sapiens (Human)
Description:P22303
Residue:614
BDBM50161487
NameBDBM50161487
Synonyms:CHEMBL3786516
TypeSmall organic molecule
Emp. Form.C14H20N2O2
Mol. Mass.248.3208
SMILESCOc1ccc2CC(CCc2c1)NC(=O)N(C)C