Reaction Details
TargetMu-type opioid receptor
LigandBDBM50454798
Substrate/Competitorn/a
Meas. Tech.ChEMBL_1567711 (CHEMBL3787926)
Ki 11±n/a nM
Citation Ishikawa, KMochizuki, YHirayama, SNemoto, TNagai, KItoh, KFujii, H Synthesis and evaluation of novel opioid ligands with a C-homomorphinan skeleton. Bioorg Med Chem24:2199-205 (2016) 
 
Mu-type opioid receptor
Name:Mu-type opioid receptor
Type:G Protein-Coupled Receptor (GPCR)
Mol. Mass.:44789.51
Organism:Homo sapiens (Human)
Description:P35372
Residue:400
BDBM50454798
NameBDBM50454798
Synonyms:7-Benzylidenenaltrexone | BNTX
TypeSmall organic molecule
Emp. Form.C27H27NO4
Mol. Mass.429.5076
SMILES[H][C@@]12Oc3c4c(C[C@@]5([H])N(CC6CC6)CC[C@@]14[C@@]5(O)C\C(=C/c1ccccc1)C2=O)ccc3O