Reaction Details
TargetDelta-type opioid receptor
LigandBDBM50161765
Substrate/Competitorn/a
Meas. Tech.ChEMBL_1567712 (CHEMBL3787927)
Ki 0.303000±n/a nM
Citation Ishikawa, KMochizuki, YHirayama, SNemoto, TNagai, KItoh, KFujii, H Synthesis and evaluation of novel opioid ligands with a C-homomorphinan skeleton. Bioorg Med Chem24:2199-205 (2016) 
 
Delta-type opioid receptor
Name:Delta-type opioid receptor
Type:G Protein-Coupled Receptor (GPCR)
Mol. Mass.:40382.98
Organism:Homo sapiens (Human)
Description:Competition binding assays were carried out using membrane preparations from transfected HN9.10 cells that constitutively expressed the delta opioid receptor.
Residue:372
BDBM50161765
NameBDBM50161765
Synonyms:CHEMBL3787263
TypeSmall organic molecule
Emp. Form.C27H28N2O2
Mol. Mass.412.5234
SMILES[H]C12Cc3ccc(O)cc3[C@@]3(CCN1CC1CC1)Cc1nc4ccccc4cc1C[C@@]23O