Reaction Details
TargetDelta-type opioid receptor
LigandBDBM50161767
Substrate/Competitorn/a
Meas. Tech.ChEMBL_1567712 (CHEMBL3787927)
Ki 2.8±n/a nM
Citation Ishikawa, KMochizuki, YHirayama, SNemoto, TNagai, KItoh, KFujii, H Synthesis and evaluation of novel opioid ligands with a C-homomorphinan skeleton. Bioorg Med Chem24:2199-205 (2016) 
 
Delta-type opioid receptor
Name:Delta-type opioid receptor
Type:G Protein-Coupled Receptor (GPCR)
Mol. Mass.:40382.98
Organism:Homo sapiens (Human)
Description:Competition binding assays were carried out using membrane preparations from transfected HN9.10 cells that constitutively expressed the delta opioid receptor.
Residue:372
BDBM50161767
NameBDBM50161767
Synonyms:CHEMBL3786970
TypeSmall organic molecule
Emp. Form.C27H29NO3
Mol. Mass.415.5241
SMILES[H][C@]12Cc3ccc(O)cc3[C@@]3(CCN1CC1CC1)CC(=O)\C(C[C@@]23O)=C\c1ccccc1