Reaction Details
TargetMu-type opioid receptor
LigandBDBM50161762
Substrate/Competitorn/a
Meas. Tech.ChEMBL_1567716 (CHEMBL3787931)
EC50>10000±n/a nM
Citation Ishikawa, KMochizuki, YHirayama, SNemoto, TNagai, KItoh, KFujii, H Synthesis and evaluation of novel opioid ligands with a C-homomorphinan skeleton. Bioorg Med Chem24:2199-205 (2016) 
 
Mu-type opioid receptor
Name:Mu-type opioid receptor
Type:G Protein-Coupled Receptor (GPCR)
Mol. Mass.:44789.51
Organism:Homo sapiens (Human)
Description:P35372
Residue:400
BDBM50161762
NameBDBM50161762
Synonyms:CHEMBL3785854
TypeSmall organic molecule
Emp. Form.C26H28N2O2
Mol. Mass.400.5127
SMILES[H]C12Cc3ccc(O)cc3[C@@]3(CCN1CC1CC1)Cc1[nH]c4ccccc4c1C[C@@]23O