Reaction Details
TargetMu-type opioid receptor
LigandBDBM50161763
Substrate/Competitorn/a
Meas. Tech.ChEMBL_1567716 (CHEMBL3787931)
EC50 6.2±n/a nM
Citation Ishikawa, KMochizuki, YHirayama, SNemoto, TNagai, KItoh, KFujii, H Synthesis and evaluation of novel opioid ligands with a C-homomorphinan skeleton. Bioorg Med Chem24:2199-205 (2016) 
 
Mu-type opioid receptor
Name:Mu-type opioid receptor
Type:G Protein-Coupled Receptor (GPCR)
Mol. Mass.:44789.51
Organism:Homo sapiens (Human)
Description:P35372
Residue:400
BDBM50161763
NameBDBM50161763
Synonyms:CHEMBL3787016
TypeSmall organic molecule
Emp. Form.C27H30N2O2
Mol. Mass.414.5393
SMILES[H][C@]12Cc3ccc(O)cc3[C@@]3(CCN1CC1CC1)Cc1[nH]c4ccccc4c1CC[C@@]23O