Reaction Details
TargetMu-type opioid receptor
LigandBDBM50161765
Substrate/Competitorn/a
Meas. Tech.ChEMBL_1567716 (CHEMBL3787931)
EC50>10000±n/a nM
Citation Ishikawa, KMochizuki, YHirayama, SNemoto, TNagai, KItoh, KFujii, H Synthesis and evaluation of novel opioid ligands with a C-homomorphinan skeleton. Bioorg Med Chem24:2199-205 (2016) 
 
Mu-type opioid receptor
Name:Mu-type opioid receptor
Type:G Protein-Coupled Receptor (GPCR)
Mol. Mass.:44789.51
Organism:Homo sapiens (Human)
Description:P35372
Residue:400
BDBM50161765
NameBDBM50161765
Synonyms:CHEMBL3787263
TypeSmall organic molecule
Emp. Form.C27H28N2O2
Mol. Mass.412.5234
SMILES[H]C12Cc3ccc(O)cc3[C@@]3(CCN1CC1CC1)Cc1nc4ccccc4cc1C[C@@]23O