Reaction Details
TargetMu-type opioid receptor
LigandBDBM50161769
Substrate/Competitorn/a
Meas. Tech.ChEMBL_1567716 (CHEMBL3787931)
EC50 55±n/a nM
Citation Ishikawa, KMochizuki, YHirayama, SNemoto, TNagai, KItoh, KFujii, H Synthesis and evaluation of novel opioid ligands with a C-homomorphinan skeleton. Bioorg Med Chem24:2199-205 (2016) 
 
Mu-type opioid receptor
Name:Mu-type opioid receptor
Type:G Protein-Coupled Receptor (GPCR)
Mol. Mass.:44789.51
Organism:Homo sapiens (Human)
Description:P35372
Residue:400
BDBM50161769
NameBDBM50161769
Synonyms:CHEMBL3785265
TypeSmall organic molecule
Emp. Form.C27H29NO3
Mol. Mass.415.5241
SMILES[H][C@]12Cc3ccc(O)cc3[C@@]3(CCN1CC1CC1)CC(=O)\C(C[C@@]23O)=C/c1ccccc1