Reaction Details
TargetDelta-type opioid receptor
LigandBDBM50161762
Substrate/Competitorn/a
Meas. Tech.ChEMBL_1567710 (CHEMBL3787925)
EC50 1.4±n/a nM
Citation Ishikawa, KMochizuki, YHirayama, SNemoto, TNagai, KItoh, KFujii, H Synthesis and evaluation of novel opioid ligands with a C-homomorphinan skeleton. Bioorg Med Chem24:2199-205 (2016) 
 
Delta-type opioid receptor
Name:Delta-type opioid receptor
Type:G Protein-Coupled Receptor (GPCR)
Mol. Mass.:40382.98
Organism:Homo sapiens (Human)
Description:Competition binding assays were carried out using membrane preparations from transfected HN9.10 cells that constitutively expressed the delta opioid receptor.
Residue:372
BDBM50161762
NameBDBM50161762
Synonyms:CHEMBL3785854
TypeSmall organic molecule
Emp. Form.C26H28N2O2
Mol. Mass.400.5127
SMILES[H]C12Cc3ccc(O)cc3[C@@]3(CCN1CC1CC1)Cc1[nH]c4ccccc4c1C[C@@]23O