Reaction Details
TargetHistone deacetylase 9
LigandBDBM19149
Substrate/Competitorn/a
Meas. Tech.ChEBML_1572337
IC50 320±n/a nM
Citation Cincinelli, RZwick, VMusso, LZuco, VDe Cesare, MZunino, FSimoes-Pires, CNurisso, AGiannini, GCuendet, MDallavalle, S Biphenyl-4-yl-acrylohydroxamic acids: Identification of a novel indolyl-substituted HDAC inhibitor with antitumor activity. Eur J Med Chem112:99-105 (2016) 
 
Histone deacetylase 9
Name:Histone deacetylase 9
Type:Enzyme
Mol. Mass.:111304.31
Organism:Homo sapiens (Human)
Description:Q9UKV0
Residue:1011
BDBM19149
NameBDBM19149
Synonyms:CHEMBL98 SAHA US10188756, Compound SAHA US11505523, Compound SAHA US9353061, SAHA US9695181, Vorinostat Zolinza suberoylanilide hydroxamic acid
TypeSmall organic molecule
Emp. Form.C14H20N2O3
Mol. Mass.264.3202
SMILESONC(=O)CCCCCCC(=O)Nc1ccccc1