Reaction Details
TargetOxidized purine nucleoside triphosphate hydrolase
LigandBDBM50152124
Substrate/Competitorn/a
Meas. Tech.ChEMBL_1572468 (CHEMBL3796259)
IC50 7.0±n/a nM
Citation Papeo, G MutT Homolog 1 (MTH1): The Silencing of a Target. J Med Chem59:2343-5 (2016) 
 
Oxidized purine nucleoside triphosphate hydrolase
Name:Oxidized purine nucleoside triphosphate hydrolase
Type:Protein
Mol. Mass.:22514.81
Organism:Homo sapiens (Human)
Description:P36639
Residue:197
BDBM50152124
NameBDBM50152124
Synonyms:CHEMBL3782004
TypeSmall organic molecule
Emp. Form.C13H12Cl2N4
Mol. Mass.295.167
SMILESNc1nc(NC2CC2)cc(n1)-c1cccc(Cl)c1Cl