Reaction Details
TargetPeptidyl-prolyl cis-trans isomerase FKBP5
LigandBDBM50162666
Substrate/Competitorn/a
Meas. Tech.ChEMBL_1570257 (CHEMBL3795199)
Ki 4300±n/a nM
Citation Gaali, SFeng, XHähle, ASippel, CBracher, AHausch, F Rapid, Structure-Based Exploration of Pipecolic Acid Amides as Novel Selective Antagonists of the FK506-Binding Protein 51. J Med Chem59:2410-22 (2016) 
 
Peptidyl-prolyl cis-trans isomerase FKBP5
Name:Peptidyl-prolyl cis-trans isomerase FKBP5
Type:PROTEIN
Mol. Mass.:51207.06
Organism:Homo sapiens (Human)
Description:ChEMBL_952910
Residue:457
BDBM50162666
NameBDBM50162666
Synonyms:CHEMBL3793962
TypeSmall organic molecule
Emp. Form.C31H47N3O6
Mol. Mass.557.7214
SMILESCOc1cc(cc(OC)c1OC)[C@H](C1CCCCC1)C(=O)N1CCCC[C@H]1C(=O)N[C@@H](C1CCCCC1)C(N)=O