Reaction Details
TargetcAMP-specific 3',5'-cyclic phosphodiesterase 4D
LigandBDBM50042056
Substrate/Competitorn/a
Meas. Tech.ChEMBL_1570282 (CHEMBL3795224)
IC50 1000±n/a nM
Citation Cai, YHGuo, YLi, ZWu, DLi, XZhang, HYang, JLu, HSun, ZLuo, HBYin, SWu, Y Discovery and modelling studies of natural ingredients from Gaultheria yunnanensis (FRANCH.) against phosphodiesterase-4. Eur J Med Chem114:134-40 (2016) 
 
cAMP-specific 3',5'-cyclic phosphodiesterase 4D
Name:cAMP-specific 3',5'-cyclic phosphodiesterase 4D
Type:Protein
Mol. Mass.:91092.69
Organism:Homo sapiens (Human)
Description:Q08499
Residue:809
BDBM50042056
NameBDBM50042056
Synonyms:(R)-4-(3-Cyclopentyloxy-4-methoxy-phenyl)-pyrrolidin-2-one | CHEMBL325795
TypeSmall organic molecule
Emp. Form.C16H21NO3
Mol. Mass.275.3428
SMILESCOc1ccc(cc1OC1CCCC1)[C@H]1CNC(=O)C1