Reaction Details
TargetApoptosis regulator Bcl-2
LigandBDBM50270877
Substrate/Competitorn/a
Meas. Tech.ChEMBL_1570358 (CHEMBL3795377)
Ki<1.000000±n/a nM
Citation Hennessy, EJ Selective inhibitors of Bcl-2 and Bcl-xL: Balancing antitumor activity with on-target toxicity. Bioorg Med Chem Lett26:2105-14 (2016) 
 
Apoptosis regulator Bcl-2
Name:Apoptosis regulator Bcl-2
Type:Homodimer or heterodimer
Mol. Mass.:26269.11
Organism:Homo sapiens (Human)
Description:P10415
Residue:239
BDBM50270877
NameBDBM50270877
Synonyms:(R)-4-(4-((2-(4-chlorophenyl)-5,5-dimethylcyclohex-1-enyl)methyl)piperazin-1-yl)-N-(4-(4-morpholino-1-(phenylthio)butan-2-ylamino)-3-(trifluoromethylsulfonyl)phenylsulfonyl)benzamide CHEMBL443684 US11344546, Example ABT-263 US11590126, Example ABT-263
TypeSmall organic molecule
Emp. Form.C47H55ClF3N5O6S3
Mol. Mass.974.613
SMILESCC1(C)CCC(=C(CN2CCN(CC2)c2ccc(cc2)C(=O)NS(=O)(=O)c2ccc(N[C@H](CCN3CCOCC3)CSc3ccccc3)c(c2)S(=O)(=O)C(F)(F)F)C1)c1ccc(Cl)cc1