Reaction Details
TargetVoltage-dependent P/Q-type calcium channel subunit alpha-1A
LigandBDBM162872
Substrate/Competitorn/a
Meas. Tech.ChEMBL_1571194 (CHEMBL3795955)
IC50>30000±n/a nM
Citation Walsh, SPShahripour, ATang, Hde Jesus, RKTeumelsan, NZhu, YFrie, JPriest, BTSwensen, AMAlonso-Galicia, MFelix, JPBrochu, RMBailey, TThomas-Fowlkes, BZhou, XPai, LYHampton, CHernandez, MOwens, KEhrhart, JRoy, SKaczorowski, GJYang, LGarcia, MLPasternak, A Differentiation of ROMK potency from hERG potency in the phenacetyl piperazine series through heterocycle incorporation. Bioorg Med Chem Lett26:2339-43 (2016) 
 
Voltage-dependent P/Q-type calcium channel subunit alpha-1A
Name:Voltage-dependent P/Q-type calcium channel subunit alpha-1A
Type:PROTEIN
Mol. Mass.:282627.16
Organism:Homo sapiens (Human)
Description:ChEMBL_880019
Residue:2506
BDBM162872
NameBDBM162872
Synonyms:US9056859, 72
TypeSmall organic molecule
Emp. Form.C23H25N7O3
Mol. Mass.447.4897
SMILESCc1c2COC(=O)c2ccc1CCN1CCN(CC1)C(=O)Cc1ccc(nc1)-n1cnnn1