Reaction Details
TargetATP-sensitive inward rectifier potassium channel 1
LigandBDBM50163353
Substrate/Competitorn/a
Meas. Tech.ChEMBL_1571177 (CHEMBL3797008)
IC50 79±n/a nM
Citation Walsh, SPShahripour, ATang, Hde Jesus, RKTeumelsan, NZhu, YFrie, JPriest, BTSwensen, AMAlonso-Galicia, MFelix, JPBrochu, RMBailey, TThomas-Fowlkes, BZhou, XPai, LYHampton, CHernandez, MOwens, KEhrhart, JRoy, SKaczorowski, GJYang, LGarcia, MLPasternak, A Differentiation of ROMK potency from hERG potency in the phenacetyl piperazine series through heterocycle incorporation. Bioorg Med Chem Lett26:2339-43 (2016) 
 
ATP-sensitive inward rectifier potassium channel 1
Name:ATP-sensitive inward rectifier potassium channel 1
Type:Enzyme
Mol. Mass.:44976.27
Organism:Rattus norvegicus (Rat)
Description:P35560
Residue:391
BDBM50163353
NameBDBM50163353
Synonyms:CHEMBL3793380
TypeSmall organic molecule
Emp. Form.C24H27N7O3
Mol. Mass.461.5163
SMILESCc1cc(cnc1CC(=O)N1CCN(CCc2ccc3C(=O)OCc3c2C)CC1)-n1cnnn1