Reaction Details
TargetPotassium voltage-gated channel subfamily H member 2
LigandBDBM50163366
Substrate/Competitorn/a
Meas. Tech.ChEMBL_1571178 (CHEMBL3797009)
IC50 5400±n/a nM
Citation Walsh, SPShahripour, ATang, Hde Jesus, RKTeumelsan, NZhu, YFrie, JPriest, BTSwensen, AMAlonso-Galicia, MFelix, JPBrochu, RMBailey, TThomas-Fowlkes, BZhou, XPai, LYHampton, CHernandez, MOwens, KEhrhart, JRoy, SKaczorowski, GJYang, LGarcia, MLPasternak, A Differentiation of ROMK potency from hERG potency in the phenacetyl piperazine series through heterocycle incorporation. Bioorg Med Chem Lett26:2339-43 (2016) 
 
Potassium voltage-gated channel subfamily H member 2
Name:Potassium voltage-gated channel subfamily H member 2
Type:Multi-pass membrane protein
Mol. Mass.:126672.65
Organism:Homo sapiens (Human)
Description:Q12809
Residue:1159
BDBM50163366
NameBDBM50163366
Synonyms:CHEMBL3792423
TypeSmall organic molecule
Emp. Form.C23H24N6O3
Mol. Mass.432.4751
SMILESO=C(Cc1ccc(nc1)-n1cnnn1)N1CCC(CCc2ccc3C(=O)OCc3c2)CC1