Reaction Details
TargetLysine-specific demethylase 5A
LigandBDBM50318639
Substrate/Competitorn/a
Meas. Tech.ChEMBL_1571723 (CHEMBL3795790)
IC50 15000±n/a nM
Citation Wu, XFang, ZYang, BZhong, LYang, QZhang, CHuang, SXiang, RSuzuki, TLi, LLYang, SY Discovery of KDM5A inhibitors: Homology modeling, virtual screening and structure-activity relationship analysis. Bioorg Med Chem Lett26:2284-8 (2016) 
 
Lysine-specific demethylase 5A
Name:Lysine-specific demethylase 5A
Type:Protein
Mol. Mass.:192091.79
Organism:Homo sapiens (Human)
Description:P29375
Residue:1690
BDBM50318639
NameBDBM50318639
Synonyms:6-hydroxy-1-methoxy-9H-xanthen-9-one | CHEMBL1084265
TypeSmall organic molecule
Emp. Form.C14H10O4
Mol. Mass.242.2268
SMILESCOc1cccc2oc3cc(O)ccc3c(=O)c12