Reaction Details
TargetProbable JmjC domain-containing histone demethylation protein 2C
LigandBDBM50163389
Substrate/Competitorn/a
Meas. Tech.ChEMBL_1571729 (CHEMBL3795796)
IC50 1900±n/a nM
Citation Wu, XFang, ZYang, BZhong, LYang, QZhang, CHuang, SXiang, RSuzuki, TLi, LLYang, SY Discovery of KDM5A inhibitors: Homology modeling, virtual screening and structure-activity relationship analysis. Bioorg Med Chem Lett26:2284-8 (2016) 
 
Probable JmjC domain-containing histone demethylation protein 2C
Name:Probable JmjC domain-containing histone demethylation protein 2C
Type:PROTEIN
Mol. Mass.:284576.53
Organism:Homo sapiens (Human)
Description:ChEMBL_116777
Residue:2540
BDBM50163389
NameBDBM50163389
Synonyms:CHEMBL3793278
TypeSmall organic molecule
Emp. Form.C5H6N4O2
Mol. Mass.154.1267
SMILESNNc1nccc(n1)C(O)=O