Reaction Details
TargetLysine-specific demethylase 5B
LigandBDBM50163389
Substrate/Competitorn/a
Meas. Tech.ChEMBL_1571730 (CHEMBL3795797)
IC50>100000±n/a nM
Citation Wu, XFang, ZYang, BZhong, LYang, QZhang, CHuang, SXiang, RSuzuki, TLi, LLYang, SY Discovery of KDM5A inhibitors: Homology modeling, virtual screening and structure-activity relationship analysis. Bioorg Med Chem Lett26:2284-8 (2016) 
 
Lysine-specific demethylase 5B
Name:Lysine-specific demethylase 5B
Type:Protein
Mol. Mass.:175659.67
Organism:Homo sapiens (Human)
Description:Q9UGL1
Residue:1544
BDBM50163389
NameBDBM50163389
Synonyms:CHEMBL3793278
TypeSmall organic molecule
Emp. Form.C5H6N4O2
Mol. Mass.154.1267
SMILESNNc1nccc(n1)C(O)=O