Reaction Details
TargetProteasome subunit beta type-5
LigandBDBM50160867
Substrate/Competitorn/a
Meas. Tech.ChEMBL_1572440 (CHEMBL3796231)
IC50 1.2±n/a nM
Citation Lei, MFeng, HWang, CLi, HShi, JWang, JLiu, ZChen, SHu, SZhu, Y 3D-QSAR-aided design, synthesis, in vitro and in vivo evaluation of dipeptidyl boronic acid proteasome inhibitors and mechanism studies. Bioorg Med Chem24:2576-88 (2016) 
 
Proteasome subunit beta type-5
Name:Proteasome subunit beta type-5
Type:Protein
Mol. Mass.:28480.96
Organism:Homo sapiens (Human)
Description:n/a
Residue:263
BDBM50160867
NameBDBM50160867
Synonyms:CHEMBL499361
TypeSmall organic molecule
Emp. Form.C25H33BN2O4
Mol. Mass.436.352
SMILESCC(C)C[C@H](NC(=O)[C@H](Cc1ccccc1)NC(=O)[C@H]1CCCc2ccccc12)B(O)O