Reaction Details
TargetCarbonic anhydrase 12
LigandBDBM50163863
Substrate/Competitorn/a
Meas. Tech.ChEMBL_1572878 (CHEMBL3801014)
Kd 450±n/a nM
Citation Talibov, VOLinkuviene, VMatulis, DDanielson, UH Kinetically Selective Inhibitors of Human Carbonic Anhydrase Isozymes I, II, VII, IX, XII, and XIII. J Med Chem59:2083-93 (2016) 
 
Carbonic anhydrase 12
Name:Carbonic anhydrase 12
Type:Enzyme
Mol. Mass.:39456.00
Organism:Homo sapiens (Human)
Description:Catalytic domain of human cloned isozyme was used in the assay
Residue:354
BDBM50163863
NameBDBM50163863
Synonyms:4-(1H-benzimidazol-1-ylacetyl)-2-chlorobenzenesulfonamide (2a) carbonic anhydrase (CA) inhibitors, benzenesulphonamide ligand, 2
TypeSmall organic molecule
Emp. Form.C15H12ClN3O3S
Mol. Mass.349.792
SMILESNS(=O)(=O)c1ccc(cc1Cl)C(=O)Cn1cnc2ccccc12