Reaction Details
TargetCarbonic anhydrase 12
LigandBDBM50163864
Substrate/Competitorn/a
Meas. Tech.ChEMBL_1572878 (CHEMBL3801014)
Kd 7100±n/a nM
Citation Talibov, VOLinkuviene, VMatulis, DDanielson, UH Kinetically Selective Inhibitors of Human Carbonic Anhydrase Isozymes I, II, VII, IX, XII, and XIII. J Med Chem59:2083-93 (2016) 
 
Carbonic anhydrase 12
Name:Carbonic anhydrase 12
Type:Enzyme
Mol. Mass.:39456.00
Organism:Homo sapiens (Human)
Description:Catalytic domain of human cloned isozyme was used in the assay
Residue:354
BDBM50163864
NameBDBM50163864
Synonyms:3-(1H-benzimidazol-1-ylacetyl)benzenesulfonamide (3a) carbonic anhydrase (CA) inhibitors, benzenesulphonamide ligand, 3
TypeSmall organic molecule
Emp. Form.C15H13N3O3S
Mol. Mass.315.347
SMILESNS(=O)(=O)c1cccc(c1)C(=O)Cn1cnc2ccccc12