Reaction Details
TargetCarbonic anhydrase 7
LigandBDBM50380144
Substrate/Competitorn/a
Meas. Tech.ChEMBL_1572870 (CHEMBL3801006)
Kd 51±n/a nM
Citation Talibov, VOLinkuviene, VMatulis, DDanielson, UH Kinetically Selective Inhibitors of Human Carbonic Anhydrase Isozymes I, II, VII, IX, XII, and XIII. J Med Chem59:2083-93 (2016) 
 
Carbonic anhydrase 7
Name:Carbonic anhydrase 7
Type:Enzyme
Mol. Mass.:29664.11
Organism:Homo sapiens (Human)
Description:Human cloned isozyme.
Residue:264
BDBM50380144
NameBDBM50380144
Synonyms:CHEMBL2010994 | carbonic anhydrase (CA) inhibitors, benzenesulphonamide ligand, 8
TypeSmall organic molecule
Emp. Form.C16H19N3O4S2
Mol. Mass.381.47
SMILESCC(C)(C)c1cc(=O)[nH]c(SCC(=O)c2ccc(cc2)S(N)(=O)=O)n1