Reaction Details
TargetCarbonic anhydrase 13
LigandBDBM50163863
Substrate/Competitorn/a
Meas. Tech.ChEMBL_1572883 (CHEMBL3801019)
Kd 8.0±n/a nM
Citation Talibov, VOLinkuviene, VMatulis, DDanielson, UH Kinetically Selective Inhibitors of Human Carbonic Anhydrase Isozymes I, II, VII, IX, XII, and XIII. J Med Chem59:2083-93 (2016) 
 
Carbonic anhydrase 13
Name:Carbonic anhydrase 13
Type:Enzyme
Mol. Mass.:29445.78
Organism:Homo sapiens (Human)
Description:Q8N1Q1
Residue:262
BDBM50163863
NameBDBM50163863
Synonyms:4-(1H-benzimidazol-1-ylacetyl)-2-chlorobenzenesulfonamide (2a) carbonic anhydrase (CA) inhibitors, benzenesulphonamide ligand, 2
TypeSmall organic molecule
Emp. Form.C15H12ClN3O3S
Mol. Mass.349.792
SMILESNS(=O)(=O)c1ccc(cc1Cl)C(=O)Cn1cnc2ccccc12