Reaction Details
TargetCarbonic anhydrase 13
LigandBDBM50429922
Substrate/Competitorn/a
Meas. Tech.ChEMBL_1572883 (CHEMBL3801019)
Kd 0.53±n/a nM
Citation Talibov, VOLinkuviene, VMatulis, DDanielson, UH Kinetically Selective Inhibitors of Human Carbonic Anhydrase Isozymes I, II, VII, IX, XII, and XIII. J Med Chem59:2083-93 (2016) 
 
Carbonic anhydrase 13
Name:Carbonic anhydrase 13
Type:Enzyme
Mol. Mass.:29445.78
Organism:Homo sapiens (Human)
Description:Q8N1Q1
Residue:262
BDBM50429922
NameBDBM50429922
Synonyms:CHEMBL2333418 | carbonic anhydrase (CA) inhibitors, benzenesulphonamide ligand, 11
TypeSmall organic molecule
Emp. Form.C9H9F4NO2S2
Mol. Mass.303.297
SMILESCCCSc1c(F)c(F)c(c(F)c1F)S(N)(=O)=O