Reaction Details
TargetCarbonic anhydrase 13
LigandBDBM50163866
Substrate/Competitorn/a
Meas. Tech.ChEMBL_1572883 (CHEMBL3801019)
Kd 1.5±n/a nM
Citation Talibov, VOLinkuviene, VMatulis, DDanielson, UH Kinetically Selective Inhibitors of Human Carbonic Anhydrase Isozymes I, II, VII, IX, XII, and XIII. J Med Chem59:2083-93 (2016) 
 
Carbonic anhydrase 13
Name:Carbonic anhydrase 13
Type:Enzyme
Mol. Mass.:29445.78
Organism:Homo sapiens (Human)
Description:Q8N1Q1
Residue:262
BDBM50163866
NameBDBM50163866
Synonyms:CHEMBL3798473 | carbonic anhydrase (CA) inhibitors, benzenesulphonamide ligand, 15
TypeSmall organic molecule
Emp. Form.C18H21F3N2O4S2
Mol. Mass.450.496
SMILESCC(C)(C)Nc1c(F)c(c(F)c(F)c1S(=O)(=O)CCc1ccccc1)S(N)(=O)=O