Reaction Details
TargetCarbonic anhydrase 12
LigandBDBM50163868
Substrate/Competitorn/a
Meas. Tech.ChEMBL_1572879 (CHEMBL3801015)
Kd 1.1±n/a nM
Citation Talibov, VOLinkuviene, VMatulis, DDanielson, UH Kinetically Selective Inhibitors of Human Carbonic Anhydrase Isozymes I, II, VII, IX, XII, and XIII. J Med Chem59:2083-93 (2016) 
 
Carbonic anhydrase 12
Name:Carbonic anhydrase 12
Type:Enzyme
Mol. Mass.:39456.00
Organism:Homo sapiens (Human)
Description:Catalytic domain of human cloned isozyme was used in the assay
Residue:354
BDBM50163868
NameBDBM50163868
Synonyms:CHEMBL3798303 | carbonic anhydrase (CA) inhibitors, benzenesulphonamide ligand, 13
TypeSmall organic molecule
Emp. Form.C17H25F3N2O4S2
Mol. Mass.442.517
SMILESCCCS(=O)(=O)c1c(F)c(F)c(c(F)c1NC1CCCCCCC1)S(N)(=O)=O