Reaction Details
TargetCarbonic anhydrase 12
LigandBDBM50163861
Substrate/Competitorn/a
Meas. Tech.ChEMBL_1572879 (CHEMBL3801015)
Kd 330±n/a nM
Citation Talibov, VOLinkuviene, VMatulis, DDanielson, UH Kinetically Selective Inhibitors of Human Carbonic Anhydrase Isozymes I, II, VII, IX, XII, and XIII. J Med Chem59:2083-93 (2016) 
 
Carbonic anhydrase 12
Name:Carbonic anhydrase 12
Type:Enzyme
Mol. Mass.:39456.00
Organism:Homo sapiens (Human)
Description:Catalytic domain of human cloned isozyme was used in the assay
Residue:354
BDBM50163861
NameBDBM50163861
Synonyms:CHEMBL3799945 | carbonic anhydrase (CA) inhibitors, benzenesulphonamide ligand, 15
TypeSmall organic molecule
Emp. Form.C14H12F4N2O3S
Mol. Mass.364.315
SMILESCOc1ccc(CNc2c(F)c(F)c(F)c(F)c2S(N)(=O)=O)cc1