Reaction Details
TargetCarbonic anhydrase 1
LigandBDBM50163866
Substrate/Competitorn/a
Meas. Tech.ChEMBL_1572863 (CHEMBL3800999)
Kd 220±n/a nM
Citation Talibov, VOLinkuviene, VMatulis, DDanielson, UH Kinetically Selective Inhibitors of Human Carbonic Anhydrase Isozymes I, II, VII, IX, XII, and XIII. J Med Chem59:2083-93 (2016) 
 
Carbonic anhydrase 1
Name:Carbonic anhydrase 1
Type:Enzyme
Mol. Mass.:28873.37
Organism:Homo sapiens (Human)
Description:P00915
Residue:261
BDBM50163866
NameBDBM50163866
Synonyms:CHEMBL3798473 | carbonic anhydrase (CA) inhibitors, benzenesulphonamide ligand, 15
TypeSmall organic molecule
Emp. Form.C18H21F3N2O4S2
Mol. Mass.450.496
SMILESCC(C)(C)Nc1c(F)c(c(F)c(F)c1S(=O)(=O)CCc1ccccc1)S(N)(=O)=O