Reaction Details
TargetCarbonic anhydrase 9
LigandBDBM50163858
Substrate/Competitorn/a
Meas. Tech.ChEMBL_1572874 (CHEMBL3801010)
Kd 150±n/a nM
Citation Talibov, VOLinkuviene, VMatulis, DDanielson, UH Kinetically Selective Inhibitors of Human Carbonic Anhydrase Isozymes I, II, VII, IX, XII, and XIII. J Med Chem59:2083-93 (2016) 
 
Carbonic anhydrase 9
Name:Carbonic anhydrase 9
Type:Enzyme
Mol. Mass.:49669.03
Organism:Homo sapiens (Human)
Description:Catalytic domain of human cloned isozyme was used in the assay
Residue:459
BDBM50163858
NameBDBM50163858
Synonyms:CHEMBL2443188 | carbonic anhydrase (CA) inhibitors, benzenesulphonamide ligand, 7
TypeSmall organic molecule
Emp. Form.C12H10ClN3O3S2
Mol. Mass.343.809
SMILESNS(=O)(=O)c1ccc(cc1Cl)C(=O)CSc1ncccn1