Reaction Details
TargetCarbonic anhydrase 2
LigandBDBM50429922
Substrate/Competitorn/a
Meas. Tech.ChEMBL_1572867 (CHEMBL3801003)
Kd 0.91±n/a nM
Citation Talibov, VOLinkuviene, VMatulis, DDanielson, UH Kinetically Selective Inhibitors of Human Carbonic Anhydrase Isozymes I, II, VII, IX, XII, and XIII. J Med Chem59:2083-93 (2016) 
 
Carbonic anhydrase 2
Name:Carbonic anhydrase 2
Type:Enzyme
Mol. Mass.:29250.71
Organism:Homo sapiens (Human)
Description:P00918
Residue:260
BDBM50429922
NameBDBM50429922
Synonyms:CHEMBL2333418 | carbonic anhydrase (CA) inhibitors, benzenesulphonamide ligand, 11
TypeSmall organic molecule
Emp. Form.C9H9F4NO2S2
Mol. Mass.303.297
SMILESCCCSc1c(F)c(F)c(c(F)c1F)S(N)(=O)=O